{"text_format":"1","workbook":"xlsx","n_sheets":8,"sheets":["Instructions","Version History","Facility Overview Information","SF6 GIS Equipment","Early Action Credit","SF6 Transferred","SF6 Gas Containers","Reference"],"not_rendered":{"charts":0,"images":0,"macros":1,"external_links":1,"defined_names":11,"comments":0,"pivot_tables":0},"unopened":[],"bounds":{"document_bytes":16777216,"sheet_cells":100000,"rows_first":2000,"rows_last":500,"rows_between":2000,"halvings":0,"cell_chars":16384,"cell_head_chars":4096},"cells_cut":0,"cells_raw":0,"read":"whole","date_system":"1900"}

{"sheet":"Instructions","index":0,"n_rows":36,"n_cols":3,"rows_kept":36,"cut":false,"hidden":false,"merged":[[0,1,0,3],[1,1,1,3],[2,1,2,3]]}
[null,"SF6 Gas Insulated Switchgear"]
[null,"Data Year 2021"]
[null,"Version: R.04"]
[]
[null,null,"This reporting form for data year 2021 largely reflects the reporting requirements of the Regulation for Reducing Sulfur Hexafluoride Emissions from Gas Insulated Switchgear (original Regulation). The emissions limit, associated inputs, and Early Action Credit are new provisions found in the Regulation for Reducing Greenhouse Gas Emissions from Gas-Insulated Equipment (amended Regulation) which became effective January 1, 2022."]
[null,null,"Original Regulation"]
[null,null,"Amended Regulation"]
[]
[null,null,"Workbook Instructions:"]
[null,null,"This workbook is protected by default and contains locked cells to ensure that the user does not inadvertently alter any of the included formulas and/or calculations."]
[]
[null,null,"Please use this workbook, and submit it to CARB, to comply with the 2021 reporting requirement. The workbook contains the following worksheets, representing the required reporting elements for the 2021 data year. Click a button below to be brought to the corresponding worksheet."]
[]
[null,null,"Facility Overview Information"]
[null,null,"SF6 GIS Equipment"]
[null,null,"Early Action Credit"]
[null,null,"SF6 Transferred"]
[null,null,"SF6 Gas Containers"]
[]
[null,null,"Cells have been color coded to indicate where user inputs are required, and where intermediate and final results of calculations can be found. The following color coding has been used:"]
{"$rows_left_out":17}
{"sheet":"Version History","index":1,"n_rows":6,"n_cols":5,"rows_kept":6,"cut":false,"hidden":false,"merged":[[0,1,0,4]]}
[null,"Version History"]
[null,"Version","Data Year(s)","Date Posted","Description"]
[null,"R.04",2021,"2022-03-04","Updated workbook per revised reporting requirements for data year 2021 and eliminated need to export to XML prior to reporting."]
[null,"R.03","2011-2020","2015-01-02","Added two columns to the SF6 Gas Containers worksheet (Date Container Weighed and Reason for Weighing Container)."]
[null,"R.02","N/A","2012-10-08","Updated workbook formatting and added XML mapping for automated upload."]
[null,"R.01","N/A","2012-07-05","Original workbook"]

{"sheet":"Facility Overview Information","index":2,"n_rows":26,"n_cols":2,"rows_kept":26,"cut":false,"hidden":false,"merged":[[0,0,0,1],[1,0,1,2],[2,0,2,2],[3,0,3,2]]}
["Facility Overview Information (Data Year 2021)"]
["This reporting form for data year 2021 largely reflects the reporting requirements of the original Regulation. The emissions limit, and associated inputs, are new requirements in the amended Regulation, which became effective January 1, 2022."]
["Original Regulation"]
["Amended Regulation"]
["Today's date   ",{"$f":"TODAY()","v":"2022-03-04"}]
["Entity Name:"]
["ARB ID:"]
[]
["Record Location (if different than physical address of entity's headquarters)"]
["Street:"]
["City:"]
["State"]
["ZIP/Postal Code:"]
[]
["Preparer's Name:"]
["Preparer's e-Mail:"]
["Preparer's Phone:"]
[]
["Reporting Year:",2021]
["Average System Capacity (pounds):"]
{"$rows_left_out":7}
{"sheet":"SF6 GIS Equipment","index":3,"n_rows":3,"n_cols":8,"rows_kept":3,"cut":false,"hidden":false,"merged":[[1,0,1,7],[0,0,0,2]]}
["SF6 GIS Equipment (Data Year 2021)"]
[]
["GIS Serial Number","GIS Equipment Type","GIS Seal Type","GIS Manufacturer","GIS Date Manufactured\n(mm/dd/yyyy)","GIS Voltage Capacity\n(kilovolts, kV)","GIS SF6 Capacity \n(lbs.)","GIS Status"]

{"sheet":"Early Action Credit","index":4,"n_rows":503,"n_cols":13,"rows_kept":503,"cut":false,"hidden":false,"merged":[[1,0,1,11],[0,0,0,3]]}
["Early Action Credit (Data Year 2021)"]
["Discussion of the \"Early Action Credit\" can be found in section 95353(d) of the amended Regulation. Completion of this worksheet is optional."]
["Serial Number","Equipment Type","Manufacturer","Date Activated for the First Time (mm/dd/yyyy)","Voltage Capacity\n(kilovolts)","Medium that Provides Insulating and/or Interrupting Functions","Covered Insulating Gas (if applicable)","Covered Insulating Gas GWP (if applicable)","Was Device Removed from Regular Use/Transferred While in Use During Data Year?","Jointly Owned?","GIE Owner's Equity Share (%)","Name, ARB ID and Equity Shares (%) of Other Co-Owners","Credit"]
[null,{"$f":"IF(AND(ISBLANK('Early Action Credit'!$A4),ISBLANK('Early Action Credit'!$C4),ISBLANK('Early Action Credit'!$D4),ISBLANK('Early Action Credit'!$E4),ISBLANK('Early Action Credit'!$F4),ISBLANK('Early Action Credit'!$G4),ISBLANK('Early Action Credit'!$H4),ISBLANK('Early Action Credit'!$I4),ISBLANK('Early Action Credit'!$J4),ISBLANK('Early Action Credit'!$L4)),\"\",\"Circuit Breaker\")","v":""},null,null,null,null,null,null,null,null,null,null,{"$f":"IF('Early Action Credit'!$I4=\"Yes\",0,IF('Early Action Credit'!$E4<72.5,0,IF('Early Action Credit'!$E4=72.5,300,IF('Early Action Credit'!$E4<=145,700,IF('Early Action Credit'!$E4<=245,1900,2400)))))*IF(ISBLANK('Early Action Credit'!$J4),0,IF('Early Action Credit'!$J4=\"No\",1,'Early Action Credit'!$K4))","v":0}]
[null,{"$f":"IF(AND(ISBLANK('Early Action Credit'!$A5),ISBLANK('Early Action Credit'!$C5),ISBLANK('Early Action Credit'!$D5),ISBLANK('Early Action Credit'!$E5),ISBLANK('Early Action Credit'!$F5),ISBLANK('Early Action Credit'!$G5),ISBLANK('Early Action Credit'!$H5),ISBLANK('Early Action Credit'!$I5),ISBLANK('Early Action Credit'!$J5),ISBLANK('Early Action Credit'!$L5)),\"\",\"Circuit Breaker\")","v":""},null,null,null,null,null,null,null,null,null,null,{"$f":"IF('Early Action Credit'!$I5=\"Yes\",0,IF('Early Action Credit'!$E5<72.5,0,IF('Early Action Credit'!$E5=72.5,300,IF('Early Action Credit'!$E5<=145,700,IF('Early Action Credit'!$E5<=245,1900,2400)))))*IF(ISBLANK('Early Action Credit'!$J5),0,IF('Early Action Credit'!$J5=\"No\",1,'Early Action Credit'!$K5))","v":0}]
[null,{"$f":"IF(AND(ISBLANK('Early Action Credit'!$A6),ISBLANK('Early Action Credit'!$C6),ISBLANK('Early Action Credit'!$D6),ISBLANK('Early Action Credit'!$E6),ISBLANK('Early Action Credit'!$F6),ISBLANK('Early Action Credit'!$G6),ISBLANK('Early Action Credit'!$H6),ISBLANK('Early Action Credit'!$I6),ISBLANK('Early Action Credit'!$J6),ISBLANK('Early Action Credit'!$L6)),\"\",\"Circuit Breaker\")","v":""},null,null,null,null,null,null,null,null,null,null,{"$f":"IF('Early Action Credit'!$I6=\"Yes\",0,IF('Early Action Credit'!$E6<72.5,0,IF('Early Action Credit'!$E6=72.5,300,IF('Early Action Credit'!$E6<=145,700,IF('Early Action Credit'!$E6<=245,1900,2400)))))*IF(ISBLANK('Early Action Credit'!$J6),0,IF('Early Action Credit'!$J6=\"No\",1,'Early Action Credit'!$K6))","v":0}]
[null,{"$f":"IF(AND(ISBLANK('Early Action Credit'!$A7),ISBLANK('Early Action Credit'!$C7),ISBLANK('Early Action Credit'!$D7),ISBLANK('Early Action Credit'!$E7),ISBLANK('Early Action Credit'!$F7),ISBLANK('Early Action Credit'!$G7),ISBLANK('Early Action Credit'!$H7),ISBLANK('Early Action Credit'!$I7),ISBLANK('Early Action Credit'!$J7),ISBLANK('Early Action Credit'!$L7)),\"\",\"Circuit Breaker\")","v":""},null,null,null,null,null,null,null,null,null,null,{"$f":"IF('Early Action Credit'!$I7=\"Yes\",0,IF('Early Action Credit'!$E7<72.5,0,IF('Early Action Credit'!$E7=72.5,300,IF('Early Action Credit'!$E7<=145,700,IF('Early Action Credit'!$E7<=245,1900,2400)))))*IF(ISBLANK('Early Action Credit'!$J7),0,IF('Early Action Credit'!$J7=\"No\",1,'Early Action Credit'!$K7))","v":0}]
[null,{"$f":"IF(AND(ISBLANK('Early Action Credit'!$A8),ISBLANK('Early Action Credit'!$C8),ISBLANK('Early Action Credit'!$D8),ISBLANK('Early Action Credit'!$E8),ISBLANK('Early Action Credit'!$F8),ISBLANK('Early Action Credit'!$G8),ISBLANK('Early Action Credit'!$H8),ISBLANK('Early Action Credit'!$I8),ISBLANK('Early Action Credit'!$J8),ISBLANK('Early Action Credit'!$L8)),\"\",\"Circuit Breaker\")","v":""},null,null,null,null,null,null,null,null,null,null,{"$f":"IF('Early Action Credit'!$I8=\"Yes\",0,IF('Early Action Credit'!$E8<72.5,0,IF('Early Action Credit'!$E8=72.5,300,IF('Early Action Credit'!$E8<=145,700,IF('Early Action Credit'!$E8<=245,1900,2400)))))*IF(ISBLANK('Early Action Credit'!$J8),0,IF('Early Action Credit'!$J8=\"No\",1,'Early Action Credit'!$K8))","v":0}]
[null,{"$f":"IF(AND(ISBLANK('Early Action Credit'!$A9),ISBLANK('Early Action Credit'!$C9),ISBLANK('Early Action Credit'!$D9),ISBLANK('Early Action Credit'!$E9),ISBLANK('Early Action Credit'!$F9),ISBLANK('Early Action Credit'!$G9),ISBLANK('Early Action Credit'!$H9),ISBLANK('Early Action Credit'!$I9),ISBLANK('Early Action Credit'!$J9),ISBLANK('Early Action Credit'!$L9)),\"\",\"Circuit Breaker\")","v":""},null,null,null,null,null,null,null,null,null,null,{"$f":"IF('Early Action Credit'!$I9=\"Yes\",0,IF('Early Action Credit'!$E9<72.5,0,IF('Early Action Credit'!$E9=72.5,300,IF('Early Action Credit'!$E9<=145,700,IF('Early Action Credit'!$E9<=245,1900,2400)))))*IF(ISBLANK('Early Action Credit'!$J9),0,IF('Early Action Credit'!$J9=\"No\",1,'Early Action Credit'!$K9))","v":0}]
[null,{"$f":"IF(AND(ISBLANK('Early Action Credit'!$A10),ISBLANK('Early Action Credit'!$C10),ISBLANK('Early Action Credit'!$D10),ISBLANK('Early Action Credit'!$E10),ISBLANK('Early Action Credit'!$F10),ISBLANK('Early Action Credit'!$G10),ISBLANK('Early Action Credit'!$H10),ISBLANK('Early Action Credit'!$I10),ISBLANK('Early Action Credit'!$J10),ISBLANK('Early Action Credit'!$L10)),\"\",\"Circuit Breaker\")","v":""},null,null,null,null,null,null,null,null,null,null,{"$f":"IF('Early Action Credit'!$I10=\"Yes\",0,IF('Early Action Credit'!$E10<72.5,0,IF('Early Action Credit'!$E10=72.5,300,IF('Early Action Credit'!$E10<=145,700,IF('Early Action Credit'!$E10<=245,1900,2400)))))*IF(ISBLANK('Early Action Credit'!$J10),0,IF('Early Action Credit'!$J10=\"No\",1,'Early Action Credit'!$K10))","v":0}]
[null,{"$f":"IF(AND(ISBLANK('Early Action Credit'!$A11),ISBLANK('Early Action Credit'!$C11),ISBLANK('Early Action Credit'!$D11),ISBLANK('Early Action Credit'!$E11),ISBLANK('Early Action Credit'!$F11),ISBLANK('Early Action Credit'!$G11),ISBLANK('Early Action Credit'!$H11),ISBLANK('Early Action Credit'!$I11),ISBLANK('Early Action Credit'!$J11),ISBLANK('Early Action Credit'!$L11)),\"\",\"Circuit Breaker\")","v":""},null,null,null,null,null,null,null,null,null,null,{"$f":"IF('Early Action Credit'!$I11=\"Yes\",0,IF('Early Action Credit'!$E11<72.5,0,IF('Early Action Credit'!$E11=72.5,300,IF('Early Action Credit'!$E11<=145,700,IF('Early Action Credit'!$E11<=245,1900,2400)))))*IF(ISBLANK('Early Action Credit'!$J11),0,IF('Early Action Credit'!$J11=\"No\",1,'Early Action Credit'!$K11))","v":0}]
[null,{"$f":"IF(AND(ISBLANK('Early Action Credit'!$A12),ISBLANK('Early Action Credit'!$C12),ISBLANK('Early Action Credit'!$D12),ISBLANK('Early Action Credit'!$E12),ISBLANK('Early Action Credit'!$F12),ISBLANK('Early Action Credit'!$G12),ISBLANK('Early Action Credit'!$H12),ISBLANK('Early Action Credit'!$I12),ISBLANK('Early Action Credit'!$J12),ISBLANK('Early Action Credit'!$L12)),\"\",\"Circuit Breaker\")","v":""},null,null,null,null,null,null,null,null,null,null,{"$f":"IF('Early Action Credit'!$I12=\"Yes\",0,IF('Early Action Credit'!$E12<72.5,0,IF('Early Action Credit'!$E12=72.5,300,IF('Early Action Credit'!$E12<=145,700,IF('Early Action Credit'!$E12<=245,1900,2400)))))*IF(ISBLANK('Early Action Credit'!$J12),0,IF('Early Action Credit'!$J12=\"No\",1,'Early Action Credit'!$K12))","v":0}]
[null,{"$f":"IF(AND(ISBLANK('Early Action Credit'!$A13),ISBLANK('Early Action Credit'!$C13),ISBLANK('Early Action Credit'!$D13),ISBLANK('Early Action Credit'!$E13),ISBLANK('Early Action Credit'!$F13),ISBLANK('Early Action Credit'!$G13),ISBLANK('Early Action Credit'!$H13),ISBLANK('Early Action Credit'!$I13),ISBLANK('Early Action Credit'!$J13),ISBLANK('Early Action Credit'!$L13)),\"\",\"Circuit Breaker\")","v":""},null,null,null,null,null,null,null,null,null,null,{"$f":"IF('Early Action Credit'!$I13=\"Yes\",0,IF('Early Action Credit'!$E13<72.5,0,IF('Early Action Credit'!$E13=72.5,300,IF('Early Action Credit'!$E13<=145,700,IF('Early Action Credit'!$E13<=245,1900,2400)))))*IF(ISBLANK('Early Action Credit'!$J13),0,IF('Early Action Credit'!$J13=\"No\",1,'Early Action Credit'!$K13))","v":0}]
[null,{"$f":"IF(AND(ISBLANK('Early Action Credit'!$A14),ISBLANK('Early Action Credit'!$C14),ISBLANK('Early Action Credit'!$D14),ISBLANK('Early Action Credit'!$E14),ISBLANK('Early Action Credit'!$F14),ISBLANK('Early Action Credit'!$G14),ISBLANK('Early Action Credit'!$H14),ISBLANK('Early Action Credit'!$I14),ISBLANK('Early Action Credit'!$J14),ISBLANK('Early Action Credit'!$L14)),\"\",\"Circuit Breaker\")","v":""},null,null,null,null,null,null,null,null,null,null,{"$f":"IF('Early Action Credit'!$I14=\"Yes\",0,IF('Early Action Credit'!$E14<72.5,0,IF('Early Action Credit'!$E14=72.5,300,IF('Early Action Credit'!$E14<=145,700,IF('Early Action Credit'!$E14<=245,1900,2400)))))*IF(ISBLANK('Early Action Credit'!$J14),0,IF('Early Action Credit'!$J14=\"No\",1,'Early Action Credit'!$K14))","v":0}]
[null,{"$f":"IF(AND(ISBLANK('Early Action Credit'!$A15),ISBLANK('Early Action Credit'!$C15),ISBLANK('Early Action Credit'!$D15),ISBLANK('Early Action Credit'!$E15),ISBLANK('Early Action Credit'!$F15),ISBLANK('Early Action Credit'!$G15),ISBLANK('Early Action Credit'!$H15),ISBLANK('Early Action Credit'!$I15),ISBLANK('Early Action Credit'!$J15),ISBLANK('Early Action Credit'!$L15)),\"\",\"Circuit Breaker\")","v":""},null,null,null,null,null,null,null,null,null,null,{"$f":"IF('Early Action Credit'!$I15=\"Yes\",0,IF('Early Action Credit'!$E15<72.5,0,IF('Early Action Credit'!$E15=72.5,300,IF('Early Action Credit'!$E15<=145,700,IF('Early Action Credit'!$E15<=245,1900,2400)))))*IF(ISBLANK('Early Action Credit'!$J15),0,IF('Early Action Credit'!$J15=\"No\",1,'Early Action Credit'!$K15))","v":0}]
[null,{"$f":"IF(AND(ISBLANK('Early Action Credit'!$A16),ISBLANK('Early Action Credit'!$C16),ISBLANK('Early Action Credit'!$D16),ISBLANK('Early Action Credit'!$E16),ISBLANK('Early Action Credit'!$F16),ISBLANK('Early Action Credit'!$G16),ISBLANK('Early Action Credit'!$H16),ISBLANK('Early Action Credit'!$I16),ISBLANK('Early Action Credit'!$J16),ISBLANK('Early Action Credit'!$L16)),\"\",\"Circuit Breaker\")","v":""},null,null,null,null,null,null,null,null,null,null,{"$f":"IF('Early Action Credit'!$I16=\"Yes\",0,IF('Early Action Credit'!$E16<72.5,0,IF('Early Action Credit'!$E16=72.5,300,IF('Early Action Credit'!$E16<=145,700,IF('Early Action Credit'!$E16<=245,1900,2400)))))*IF(ISBLANK('Early Action Credit'!$J16),0,IF('Early Action Credit'!$J16=\"No\",1,'Early Action Credit'!$K16))","v":0}]
[null,{"$f":"IF(AND(ISBLANK('Early Action Credit'!$A17),ISBLANK('Early Action Credit'!$C17),ISBLANK('Early Action Credit'!$D17),ISBLANK('Early Action Credit'!$E17),ISBLANK('Early Action Credit'!$F17),ISBLANK('Early Action Credit'!$G17),ISBLANK('Early Action Credit'!$H17),ISBLANK('Early Action Credit'!$I17),ISBLANK('Early Action Credit'!$J17),ISBLANK('Early Action Credit'!$L17)),\"\",\"Circuit Breaker\")","v":""},null,null,null,null,null,null,null,null,null,null,{"$f":"IF('Early Action Credit'!$I17=\"Yes\",0,IF('Early Action Credit'!$E17<72.5,0,IF('Early Action Credit'!$E17=72.5,300,IF('Early Action Credit'!$E17<=145,700,IF('Early Action Credit'!$E17<=245,1900,2400)))))*IF(ISBLANK('Early Action Credit'!$J17),0,IF('Early Action Credit'!$J17=\"No\",1,'Early Action Credit'!$K17))","v":0}]
[null,{"$f":"IF(AND(ISBLANK('Early Action Credit'!$A18),ISBLANK('Early Action Credit'!$C18),ISBLANK('Early Action Credit'!$D18),ISBLANK('Early Action Credit'!$E18),ISBLANK('Early Action Credit'!$F18),ISBLANK('Early Action Credit'!$G18),ISBLANK('Early Action Credit'!$H18),ISBLANK('Early Action Credit'!$I18),ISBLANK('Early Action Credit'!$J18),ISBLANK('Early Action Credit'!$L18)),\"\",\"Circuit Breaker\")","v":""},null,null,null,null,null,null,null,null,null,null,{"$f":"IF('Early Action Credit'!$I18=\"Yes\",0,IF('Early Action Credit'!$E18<72.5,0,IF('Early Action Credit'!$E18=72.5,300,IF('Early Action Credit'!$E18<=145,700,IF('Early Action Credit'!$E18<=245,1900,2400)))))*IF(ISBLANK('Early Action Credit'!$J18),0,IF('Early Action Credit'!$J18=\"No\",1,'Early Action Credit'!$K18))","v":0}]
[null,{"$f":"IF(AND(ISBLANK('Early Action Credit'!$A19),ISBLANK('Early Action Credit'!$C19),ISBLANK('Early Action Credit'!$D19),ISBLANK('Early Action Credit'!$E19),ISBLANK('Early Action Credit'!$F19),ISBLANK('Early Action Credit'!$G19),ISBLANK('Early Action Credit'!$H19),ISBLANK('Early Action Credit'!$I19),ISBLANK('Early Action Credit'!$J19),ISBLANK('Early Action Credit'!$L19)),\"\",\"Circuit Breaker\")","v":""},null,null,null,null,null,null,null,null,null,null,{"$f":"IF('Early Action Credit'!$I19=\"Yes\",0,IF('Early Action Credit'!$E19<72.5,0,IF('Early Action Credit'!$E19=72.5,300,IF('Early Action Credit'!$E19<=145,700,IF('Early Action Credit'!$E19<=245,1900,2400)))))*IF(ISBLANK('Early Action Credit'!$J19),0,IF('Early Action Credit'!$J19=\"No\",1,'Early Action Credit'!$K19))","v":0}]
[null,{"$f":"IF(AND(ISBLANK('Early Action Credit'!$A20),ISBLANK('Early Action Credit'!$C20),ISBLANK('Early Action Credit'!$D20),ISBLANK('Early Action Credit'!$E20),ISBLANK('Early Action Credit'!$F20),ISBLANK('Early Action Credit'!$G20),ISBLANK('Early Action Credit'!$H20),ISBLANK('Early Action Credit'!$I20),ISBLANK('Early Action Credit'!$J20),ISBLANK('Early Action Credit'!$L20)),\"\",\"Circuit Breaker\")","v":""},null,null,null,null,null,null,null,null,null,null,{"$f":"IF('Early Action Credit'!$I20=\"Yes\",0,IF('Early Action Credit'!$E20<72.5,0,IF('Early Action Credit'!$E20=72.5,300,IF('Early Action Credit'!$E20<=145,700,IF('Early Action Credit'!$E20<=245,1900,2400)))))*IF(ISBLANK('Early Action Credit'!$J20),0,IF('Early Action Credit'!$J20=\"No\",1,'Early Action Credit'!$K20))","v":0}]
{"$rows_left_out":484}
{"sheet":"SF6 Transferred","index":5,"n_rows":3,"n_cols":3,"rows_kept":3,"cut":false,"hidden":false,"merged":[[0,0,0,2],[1,0,1,5]]}
["SF6 Transferred (Data Year 2021)"]
[]
["GIS Serial Number","Date SF6 Transferred\n(mm/dd/yyyy)","Amount Transferred \n(lbs.)"]

{"sheet":"SF6 Gas Containers","index":6,"n_rows":3,"n_cols":9,"rows_kept":3,"cut":false,"hidden":false,"merged":[[1,0,1,8],[0,0,0,2]]}
["SF6 Gas Containers (Data Year 2021)"]
[]
["Container ID","Container Size \n(SF6 capacity in pounds)","Street Address","City","State","ZIP/Postal Code","SF6 Weight in Container (lb)","Date Container Weighed (mm/dd/yyyy)","Reason for Weighing Container"]

{"sheet":"Reference","index":7,"n_rows":17,"n_cols":10,"rows_kept":17,"cut":false,"hidden":true,"merged":[[0,0,0,16383],[2,0,2,1]]}
["Reference Data"]
[]
["Insulating Gases",null,null,"Seal Types",null,"Status Changes",null,"Equipment Types",null,"Sections for Measurement Reported"]
["Insulating Gas","GWP",null,"Seal Type",null,"Status Change",null,"Equipment Type",null,"Section for Measurement Reported"]
["SF6",22800,null,"Hermetic",null,"Activated for first time",null,"Circuit breaker",null,"95354(g)(1): Gas container owned/stored"]
[null,null,null,"Non-hermetic",null,"Activated for first time and removed from regular use",null,null,null,"95354(g)(2): Gas container not owned/stored"]
[null,null,null,null,null,"Activated for first time and transferred while in use to another entity",null,null,null,"95354(j)(2-3): Gas cart owned/stored"]
[null,null,null,"Yes/No",null,"Removed from regular use",null,null,null,"95354(j)(4): Gas cart not owned/stored"]
[null,null,null,"Yes/No",null,"Transferred while in use to another entity"]
[null,null,null,"Yes",null,"Transferred while in use from another entity"]
[null,null,null,"No"]
[]
[null,null,null,"GIS Statuses",null,"Reasons for Weighing Gas Cart or Gas Container"]
[null,null,null,"GIS Status",null,"Reason For Weighing"]
[null,null,null,"Active",null,"Added to Inventory"]
[null,null,null,"Inactive",null,"Removed from Inventory"]
[null,null,null,null,null,"End of Calendar Year Weighing"]